Target
Interstitial collagenase
Ligand
BDBM50429815
Substrate
Meas. Tech.
ChEMBL_948654 (CHEMBL2345604)
IC50
>5000±n/a nM
Citation
 Nuti, ESantamaria, SCasalini, FYamamoto, KMarinelli, LLa Pietra, VNovellino, EOrlandini, ENencetti, SMarini, AMSalerno, STaliani, SDa Settimo, FNagase, HRossello, A Arylsulfonamide inhibitors of aggrecanases as potential therapeutic agents for osteoarthritis: synthesis and biological evaluation. Eur J Med Chem 62:379-94 (2013)  
Target
Name:
Interstitial collagenase
Synonyms:
CLG MMP1 Matrix metalloproteinase-1 | Matrix metalloproteinase-1 (MMP-1)
Type:
Enzyme
Mol. Mass.:
54010.26
Organism:
Homo sapiens (Human)
Description:
P03956
Residue:
469
  
Inhibitor
Name:
BDBM50429815
Synonyms:
CHEMBL2337698
Type:
Small organic molecule
Emp. Form.:
C15H14ClFN2O5S
Mol. Mass.:
388.798
SMILES:
ONC(=O)CNS(=O)(=O)c1ccc(OCc2ccc(F)cc2Cl)cc1
: