Target
Lysophosphatidic acid receptor 3
Ligand
BDBM50430008
Substrate
Meas. Tech.
ChEMBL_946258 (CHEMBL2344996)
EC50
0.390000±n/a nM
Citation
 Jiang, GInoue, AAoki, JPrestwich, GD Phosphorothioate analogs of sn-2 radyl lysophosphatidic acid (LPA): metabolically stabilized LPA receptor agonists. Bioorg Med Chem Lett 23:1865-9 (2013)  
Target
Name:
Lysophosphatidic acid receptor 3
Synonyms:
EDG7 LPAR3 Lysophosphatidic acid receptor 1/3 Lysophosphatidic acid receptor Edg-7
Type:
Enzyme
Mol. Mass.:
40149.72
Organism:
Homo sapiens (Human)
Description:
Q9UBY5
Residue:
353
  
Inhibitor
Name:
BDBM50430008
Synonyms:
CHEMBL2335050
Type:
Small organic molecule
Emp. Form.:
C21H44O5PS
Mol. Mass.:
439.61
SMILES:
CCCCCCCCCCCCCCCCCOC(COC)COP(O)([O-])=S
: