Target
Lysophosphatidic acid receptor 3
Ligand
BDBM50430012
Substrate
Meas. Tech.
ChEMBL_946258 (CHEMBL2344996)
EC50
0.270000±n/a nM
Citation
 Jiang, GInoue, AAoki, JPrestwich, GD Phosphorothioate analogs of sn-2 radyl lysophosphatidic acid (LPA): metabolically stabilized LPA receptor agonists. Bioorg Med Chem Lett 23:1865-9 (2013)  
Target
Name:
Lysophosphatidic acid receptor 3
Synonyms:
EDG7 LPAR3 Lysophosphatidic acid receptor 1/3 Lysophosphatidic acid receptor Edg-7
Type:
Enzyme
Mol. Mass.:
40149.72
Organism:
Homo sapiens (Human)
Description:
Q9UBY5
Residue:
353
  
Inhibitor
Name:
BDBM50430012
Synonyms:
CHEMBL357053
Type:
Small organic molecule
Emp. Form.:
C22H45O6PS
Mol. Mass.:
468.628
SMILES:
CCCCCCCCCCCCCCCCCC(=O)OC[C@@H](COP(O)(O)=S)OC
: