Target
Carbonic anhydrase 2
Ligand
BDBM26997
Substrate
Meas. Tech.
ChEMBL_942941 (CHEMBL2343319)
Ki
49200000±n/a nM
Citation
 Monti, SMDe Simone, GDathan, NALudwig, MVullo, DScozzafava, ACapasso, CSupuran, CT Kinetic and anion inhibition studies of aß-carbonic anhydrase (FbiCA 1) from the C4 plant Flaveria bidentis. Bioorg Med Chem Lett 23:1626-30 (2013)  
Target
Name:
Carbonic anhydrase 2
Synonyms:
CA-II CAC Carbonate dehydratase II Carbonic anhydrase 2 (CA-II) Carbonic anhydrase C Carbonic anhydrase II (CA-II) Carbonic anhydrase II (hCA II) | Carbonic anhydrase isoenzyme II (hCA II)
Type:
Enzyme
Mol. Mass.:
29250.71
Organism:
Homo sapiens (Human)
Description:
P00918
Residue:
260
  
Inhibitor
Name:
BDBM26997
Synonyms:
CHEMBL364571 benzenarsonic acid phenylarsonic acid
Type:
Emp. Form.:
C6H7AsO3
Mol. Mass.:
202.0396
SMILES:
O[As](O)(=O)c1ccccc1
: