Target
Carbonic anhydrase 2
Ligand
BDBM50344898
Substrate
Meas. Tech.
ChEMBL_942941 (CHEMBL2343319)
Ki
690000±n/a nM
Citation
 Monti, SMDe Simone, GDathan, NALudwig, MVullo, DScozzafava, ACapasso, CSupuran, CT Kinetic and anion inhibition studies of aß-carbonic anhydrase (FbiCA 1) from the C4 plant Flaveria bidentis. Bioorg Med Chem Lett 23:1626-30 (2013)  
Target
Name:
Carbonic anhydrase 2
Synonyms:
CA-II CAC Carbonate dehydratase II Carbonic anhydrase 2 (CA-II) Carbonic anhydrase C Carbonic anhydrase II (CA-II) Carbonic anhydrase II (hCA II) | Carbonic anhydrase isoenzyme II (hCA II)
Type:
Enzyme
Mol. Mass.:
29250.71
Organism:
Homo sapiens (Human)
Description:
P00918
Residue:
260
  
Inhibitor
Name:
BDBM50344898
Synonyms:
CHEMBL1081267 | sodium perruthenate
Type:
Small organic molecule
Emp. Form.:
O4Ru
Mol. Mass.:
165.07
SMILES:
O=[Ru-](=O)(=O)=O
: