Target
Carbonic anhydrase 2
Ligand
BDBM60995
Substrate
Meas. Tech.
ChEMBL_942941 (CHEMBL2343319)
Ki
30000±n/a nM
Citation
 Monti, SMDe Simone, GDathan, NALudwig, MVullo, DScozzafava, ACapasso, CSupuran, CT Kinetic and anion inhibition studies of aß-carbonic anhydrase (FbiCA 1) from the C4 plant Flaveria bidentis. Bioorg Med Chem Lett 23:1626-30 (2013)  
Target
Name:
Carbonic anhydrase 2
Synonyms:
CA-II CAC Carbonate dehydratase II Carbonic anhydrase 2 (CA-II) Carbonic anhydrase C Carbonic anhydrase II (CA-II) Carbonic anhydrase II (hCA II) | Carbonic anhydrase isoenzyme II (hCA II)
Type:
Enzyme
Mol. Mass.:
29250.71
Organism:
Homo sapiens (Human)
Description:
P00918
Residue:
260
  
Inhibitor
Name:
BDBM60995
Synonyms:
BDBM50401535 fulminate ion
Type:
Emp. Form.:
CNO
Mol. Mass.:
42.0173
SMILES:
[O-][N+]#[C-]
: