Target
Prostaglandin E synthase
Ligand
BDBM50430931
Substrate
Meas. Tech.
ChEMBL_945919 (CHEMBL2340533)
IC50
1800±n/a nM
Citation
 He, SLi, CLiu, YLai, L Discovery of highly potent microsomal prostaglandin e2 synthase 1 inhibitors using the active conformation structural model and virtual screen. J Med Chem 56:3296-309 (2013)  
Target
Name:
Prostaglandin E synthase
Synonyms:
MGST1L1 PGES PTGES Prostaglandin E synthase (PGES-1) Prostaglandin E synthase-1 (PGES-1) Prostaglandin E2 synthase-1 ( mPGES-1)
Type:
Protein
Mol. Mass.:
17112.22
Organism:
Homo sapiens (Human)
Description:
Residue:
152
  
Inhibitor
Name:
BDBM50430931
Synonyms:
CHEMBL2336947
Type:
Small organic molecule
Emp. Form.:
C18H15N5O6S
Mol. Mass.:
429.407
SMILES:
Cc1nc2sc3CCCCc3c2c(=O)n1\N=C\c1cc(cc(c1O)[N+]([O-])=O)[N+]([O-])=O
: