Target
Prostaglandin E synthase
Ligand
BDBM50430920
Substrate
Meas. Tech.
ChEMBL_945919 (CHEMBL2340533)
IC50
2500±n/a nM
Citation
 He, SLi, CLiu, YLai, L Discovery of highly potent microsomal prostaglandin e2 synthase 1 inhibitors using the active conformation structural model and virtual screen. J Med Chem 56:3296-309 (2013)  
Target
Name:
Prostaglandin E synthase
Synonyms:
MGST1L1 PGES PTGES Prostaglandin E synthase (PGES-1) Prostaglandin E synthase-1 (PGES-1) Prostaglandin E2 synthase-1 ( mPGES-1)
Type:
Protein
Mol. Mass.:
17112.22
Organism:
Homo sapiens (Human)
Description:
Residue:
152
  
Inhibitor
Name:
BDBM50430920
Synonyms:
CHEMBL2336485
Type:
Small organic molecule
Emp. Form.:
C23H17N3OS
Mol. Mass.:
383.466
SMILES:
O=C(CSc1nnc(-c2ccccc2)c(n1)-c1ccccc1)c1ccccc1
: