Target
Prostaglandin E synthase
Ligand
BDBM50430942
Substrate
Meas. Tech.
ChEMBL_945919 (CHEMBL2340533)
IC50
9.3±n/a nM
Citation
 He, SLi, CLiu, YLai, L Discovery of highly potent microsomal prostaglandin e2 synthase 1 inhibitors using the active conformation structural model and virtual screen. J Med Chem 56:3296-309 (2013)  
Target
Name:
Prostaglandin E synthase
Synonyms:
MGST1L1 PGES PTGES Prostaglandin E synthase (PGES-1) Prostaglandin E synthase-1 (PGES-1) Prostaglandin E2 synthase-1 ( mPGES-1)
Type:
Protein
Mol. Mass.:
17112.22
Organism:
Homo sapiens (Human)
Description:
Residue:
152
  
Inhibitor
Name:
BDBM50430942
Synonyms:
CHEMBL2336516
Type:
Small organic molecule
Emp. Form.:
C21H24N6O3S
Mol. Mass.:
440.519
SMILES:
Cc1ccc(cc1NC(=O)CSc1nnc(CNc2c(C)cccc2C)n1C)[N+]([O-])=O
: