Target
Prostaglandin E synthase
Ligand
BDBM50227631
Substrate
Meas. Tech.
ChEMBL_945919 (CHEMBL2340533)
IC50
3.0±n/a nM
Citation
 He, SLi, CLiu, YLai, L Discovery of highly potent microsomal prostaglandin e2 synthase 1 inhibitors using the active conformation structural model and virtual screen. J Med Chem 56:3296-309 (2013)  
Target
Name:
Prostaglandin E synthase
Synonyms:
MGST1L1 PGES PTGES Prostaglandin E synthase (PGES-1) Prostaglandin E synthase-1 (PGES-1) Prostaglandin E2 synthase-1 ( mPGES-1)
Type:
Protein
Mol. Mass.:
17112.22
Organism:
Homo sapiens (Human)
Description:
Residue:
152
  
Inhibitor
Name:
BDBM50227631
Synonyms:
2-(6-chloro-1H-phenanthro[9,10-d]imidazol-2-yl)isophthalonitrile | CHEMBL412099
Type:
Small organic molecule
Emp. Form.:
C23H11ClN4
Mol. Mass.:
378.813
SMILES:
Clc1ccc2c3[nH]c(nc3c3ccccc3c2c1)-c1c(cccc1C#N)C#N
: