Target
NAD-dependent protein deacetylase sirtuin-2
Ligand
BDBM50431121
Substrate
Meas. Tech.
ChEMBL_948317 (CHEMBL2341151)
IC50
1.3±n/a nM
Citation
 Disch, JSEvindar, GChiu, CHBlum, CADai, HJin, LSchuman, ELind, KEBelyanskaya, SLDeng, JCoppo, FAquilani, LGraybill, TLCuozzo, JWLavu, SMao, CVlasuk, GPPerni, RB Discovery of thieno[3,2-d]pyrimidine-6-carboxamides as potent inhibitors of SIRT1, SIRT2, and SIRT3. J Med Chem 56:3666-79 (2013)  
Target
Name:
NAD-dependent protein deacetylase sirtuin-2
Synonyms:
NAD-Dependent Deacetylase Sirtuin-2 NAD-dependent deacetylase sirtuin 3 SIR2-like SIR2L SIR2_HUMAN Sirtuin 2 (SIRT2)
Type:
Hydrolase
Mol. Mass.:
43172.62
Organism:
Homo sapiens (Human)
Description:
Residue:
389
  
Inhibitor
Name:
BDBM50431121
Synonyms:
CHEMBL2332037
Type:
Small organic molecule
Emp. Form.:
C24H28N6O3S
Mol. Mass.:
480.583
SMILES:
CCNC(=O)c1cccc(c1)C(=O)NCCC1CCN(CC1)c1ncnc2cc(sc12)C(N)=O
: