Target
Aminopeptidase N
Ligand
BDBM50353016
Substrate
Meas. Tech.
ChEMBL_951228 (CHEMBL2353229)
Ki
7.0±n/a nM
Citation
 Schmitt, CVoegelin, MMarin, ASchmitt, MSchegg, FHénon, PGuenot, DTarnus, C Selective aminopeptidase-N (CD13) inhibitors with relevance to cancer chemotherapy. Bioorg Med Chem 21:2135-44 (2013)  
Target
Name:
Aminopeptidase N
Synonyms:
AMPN_PIG AP-M Alanyl aminopeptidase Aminopeptidase N (APN) Microsomal aminopeptidase pAPN
Type:
Protein
Mol. Mass.:
108810.25
Organism:
Sus scrofa (Pig)
Description:
P15145
Residue:
963
  
Inhibitor
Name:
BDBM50353016
Synonyms:
CHEMBL1821978
Type:
Small organic molecule
Emp. Form.:
C17H17NO
Mol. Mass.:
251.323
SMILES:
NC1CCc2cccc(c2CC1=O)-c1ccccc1
: