Target
Neuromedin-K receptor
Ligand
BDBM50281562
Substrate
Meas. Tech.
ChEMBL_950964 (CHEMBL2350290)
EC50
0.210000±n/a nM
Citation
 Misu, RNoguchi, TOhno, HOishi, SFujii, N Structure-activity relationship study of tachykinin peptides for the development of novel neurokinin-3 receptor selective agonists. Bioorg Med Chem 21:2413-7 (2013)  
Target
Name:
Neuromedin-K receptor
Synonyms:
NK-3 receptor NK3R NKR Neurokinin B receptor Neuromedin-3 receptor (NK-3R) Neuromedin-K receptor Neuromedin-K receptor (NK3) TAC3R Tachykinin receptor 3 | Tachykinin receptor 3 (NK3)
Type:
Enzyme
Mol. Mass.:
52221.96
Organism:
Homo sapiens (Human)
Description:
P29371
Residue:
465
  
Inhibitor
Name:
BDBM50281562
Synonyms:
Asp-Val-Pro-Lys-Ser-Asp-Gln-Phe-Val-Gly-Leu-Met-NH2 | CHEMBL436706
Type:
Small organic molecule
Emp. Form.:
C59H94N14O19S
Mol. Mass.:
1335.525
SMILES:
CSCC[C@H](NC(=O)[C@H](CC(C)C)NC(=O)CNC(=O)[C@@H](NC(=O)[C@H](Cc1ccccc1)NC(=O)[C@H](CCC(O)=O)NC(=O)[C@H](CC(O)=O)NC(=O)[C@H](CO)NC(=O)[C@H](CCCCN)NC(=O)[C@@H]1CCCN1C(=O)[C@@H](NC(=O)[C@@H](N)CC(O)=O)C(C)C)C(C)C)C(N)=O
: