Target
Mitogen-activated protein kinase 10
Ligand
BDBM50430450
Substrate
Meas. Tech.
ChEMBL_952816 (CHEMBL2351321)
Kd
2640±n/a nM
Citation
 Kim, MHLee, JJung, KKim, MPark, YJAhn, HKwon, YHHah, JM Syntheses and biological evaluation of 1-heteroaryl-2-aryl-1H-benzimidazole derivatives as c-Jun N-terminal kinase inhibitors with neuroprotective effects. Bioorg Med Chem 21:2271-85 (2013)  
Target
Name:
Mitogen-activated protein kinase 10
Synonyms:
JNK3 MAP kinase p49 3F12 MK10_HUMAN Mitogen-activated protein kinase 10 (Stress-activated protein kinase JNK3) (c-Jun N-terminal kinase 3) (MAP kinase p49 3F12) PRKM10 Stress-activated protein kinase JNK3 | c-Jun N-terminal kinase 3 (JNK3)
Type:
Enzyme
Mol. Mass.:
52586.89
Organism:
Homo sapiens (Human)
Description:
Residue:
464
  
Inhibitor
Name:
BDBM50430450
Synonyms:
CHEMBL2334716
Type:
Small organic molecule
Emp. Form.:
C27H27N5O2
Mol. Mass.:
453.5356
SMILES:
Oc1cccc(c1)-c1nc2ccccc2n1-c1ccnc(N[C@@H]2CCCN(C2)C(=O)C2CC2)c1
: