Target
Cytochrome P450 2C9
Ligand
BDBM50433194
Substrate
Meas. Tech.
ChEMBL_957079 (CHEMBL2378544)
IC50
40300±n/a nM
Citation
 Labeeuw, OLevoin, NPoupardin-Olivier, OCalmels, TLigneau, XBerrebi-Bertrand, IRobert, PLecomte, JMSchwartz, JCCapet, M Novel and highly potent histamine H3 receptor ligands. Part 3: an alcohol function to improve the pharmacokinetic profile. Bioorg Med Chem Lett 23:2548-54 (2013)  
Target
Name:
Cytochrome P450 2C9
Synonyms:
(R)-limonene 6-monooxygenase CP2C9_HUMAN CYP2C9 Cytochrome P450 2C9 (CYP2C9 ) P-450MP P450 PB-1 | S-mephenytoin 4-hydroxylase
Type:
Enzyme
Mol. Mass.:
55636.33
Organism:
Homo sapiens (Human)
Description:
P11712
Residue:
490
  
Inhibitor
Name:
BDBM50433194
Synonyms:
CHEMBL2375587
Type:
Small organic molecule
Emp. Form.:
C20H31NO2
Mol. Mass.:
317.4656
SMILES:
O[C@H]1CC[C@@H](CC1)c1ccc(OCCCN2CCCCC2)cc1
: