Target
Histamine H3 receptor
Ligand
BDBM50433196
Substrate
Meas. Tech.
ChEMBL_957095 (CHEMBL2378560)
Ki
14±n/a nM
Citation
 Labeeuw, OLevoin, NPoupardin-Olivier, OCalmels, TLigneau, XBerrebi-Bertrand, IRobert, PLecomte, JMSchwartz, JCCapet, M Novel and highly potent histamine H3 receptor ligands. Part 3: an alcohol function to improve the pharmacokinetic profile. Bioorg Med Chem Lett 23:2548-54 (2013)  
Target
Name:
Histamine H3 receptor
Synonyms:
HH3R Hrh3
Type:
PROTEIN
Mol. Mass.:
48560.37
Organism:
Mus musculus
Description:
ChEMBL_988451
Residue:
445
  
Inhibitor
Name:
BDBM50433196
Synonyms:
CHEMBL2375593
Type:
Small organic molecule
Emp. Form.:
C19H31NO2
Mol. Mass.:
305.4549
SMILES:
CCC(O)(CC)c1ccc(OCCCN2CCCCC2)cc1
: