Target
Histamine H3 receptor
Ligand
BDBM50433194
Substrate
Meas. Tech.
ChEMBL_957095 (CHEMBL2378560)
Ki
6.9±n/a nM
Citation
 Labeeuw, OLevoin, NPoupardin-Olivier, OCalmels, TLigneau, XBerrebi-Bertrand, IRobert, PLecomte, JMSchwartz, JCCapet, M Novel and highly potent histamine H3 receptor ligands. Part 3: an alcohol function to improve the pharmacokinetic profile. Bioorg Med Chem Lett 23:2548-54 (2013)  
Target
Name:
Histamine H3 receptor
Synonyms:
HH3R Hrh3
Type:
PROTEIN
Mol. Mass.:
48560.37
Organism:
Mus musculus
Description:
ChEMBL_988451
Residue:
445
  
Inhibitor
Name:
BDBM50433194
Synonyms:
CHEMBL2375587
Type:
Small organic molecule
Emp. Form.:
C20H31NO2
Mol. Mass.:
317.4656
SMILES:
O[C@H]1CC[C@@H](CC1)c1ccc(OCCCN2CCCCC2)cc1
: