Target
Aurora kinase A
Ligand
BDBM50433635
Substrate
Meas. Tech.
ChEMBL_959028 (CHEMBL2382841)
IC50
2.0±n/a nM
Citation
 Karra, SXiao, YChen, XLiu-Bujalski, LHuck, BSutton, AGoutopoulos, AAskew, BJosephson, KJiang, XShutes, AShankar, VNoonan, TGarcia-Berrios, GDong, RDhanabal, MTian, HWang, ZClark, AGoodstal, S SAR and evaluation of novel 5H-benzo[c][1,8]naphthyridin-6-one analogs as Aurora kinase inhibitors. Bioorg Med Chem Lett 23:3081-7 (2013)  
Target
Name:
Aurora kinase A
Synonyms:
AIK ARK-1 AURA AURKA_HUMAN Aurora 2 Aurora kinase A (AURKA) Aurora kinase A (Aurora-2) Aurora/IPL1-related kinase 1 Breast tumor-amplified kinase IAK1 STK15 GN Serine/threonine kinase 15 Serine/threonine-protein kinase 6 Serine/threonine-protein kinase aurora-A aurora-2 | hARK1
Type:
Serine/threonine-protein kinase
Mol. Mass.:
45830.98
Organism:
Homo sapiens (Human)
Description:
O14965
Residue:
403
  
Inhibitor
Name:
BDBM50433635
Synonyms:
CHEMBL2380830
Type:
Small organic molecule
Emp. Form.:
C25H16F2N4O2
Mol. Mass.:
442.4169
SMILES:
Fc1ccc(C(=O)Nc2ccc(Nc3ccnc4[nH]c(=O)c5ccccc5c34)cc2)c(F)c1
: