Target
Cytochrome P450 2C9
Ligand
BDBM50434684
Substrate
Meas. Tech.
ChEMBL_961191 (CHEMBL2389927)
IC50
5200±n/a nM
Citation
 Shiro, TKakiguchi, KTakahashi, HNagata, HTobe, M 7-Phenyl-imidazoquinolin-4(5H)-one derivatives as selective and orally available mPGES-1 inhibitors. Bioorg Med Chem 21:2868-78 (2013)  
Target
Name:
Cytochrome P450 2C9
Synonyms:
(R)-limonene 6-monooxygenase CP2C9_HUMAN CYP2C9 Cytochrome P450 2C9 (CYP2C9 ) P-450MP P450 PB-1 | S-mephenytoin 4-hydroxylase
Type:
Enzyme
Mol. Mass.:
55636.33
Organism:
Homo sapiens (Human)
Description:
P11712
Residue:
490
  
Inhibitor
Name:
BDBM50434684
Synonyms:
CHEMBL2387600
Type:
Small organic molecule
Emp. Form.:
C23H16ClN3O
Mol. Mass.:
385.846
SMILES:
Clc1ccccc1-c1nc2c([nH]1)c(=O)[nH]c1cc(Cc3ccccc3)ccc21
: