Target
Microtubule-associated protein 2
Ligand
BDBM50435185
Substrate
Meas. Tech.
ChEMBL_963502 (CHEMBL2394383)
EC50
>100000±n/a nM
Citation
 Zhang, PYang, XZhang, FGabelli, SBWang, RZhang, YBhat, SChen, XFurlani, MAmzel, LMLiu, JOMa, D Pyridinylpyrimidines selectively inhibit human methionine aminopeptidase-1. Bioorg Med Chem 21:2600-17 (2013)  
Target
Name:
Microtubule-associated protein 2
Synonyms:
MAP-2 MTAP2_HUMAN
Type:
PROTEIN
Mol. Mass.:
199423.64
Organism:
Homo sapiens (Human)
Description:
ChEMBL_107603
Residue:
1827
  
Inhibitor
Name:
BDBM50435185
Synonyms:
CHEMBL2392931
Type:
Small organic molecule
Emp. Form.:
C26H28Cl2N6
Mol. Mass.:
495.447
SMILES:
Cc1nc(nc(NC[C@H](NCCCCn2cccc2)c2ccccc2)c1Cl)-c1ccc(Cl)cn1
: