Target
Sodium/glucose cotransporter 2
Ligand
BDBM50436108
Substrate
Meas. Tech.
ChEMBL_968063 (CHEMBL2401415)
IC50
99±n/a nM
Citation
 Ikegai, KImamura, MSuzuki, TNakanishi, KMurakami, TKurosaki, ENoda, AKobayashi, YYokota, MKoide, TKosakai, KOhkura, YTakeuchi, MTomiyama, HOhta, M Synthesis and biological evaluation of C-glucosides with azulene rings as selective SGLT2 inhibitors for the treatment of type 2 diabetes mellitus: discovery of YM543. Bioorg Med Chem 21:3934-48 (2013)  
Target
Name:
Sodium/glucose cotransporter 2
Synonyms:
Na(+)/glucose cotransporter 2 SGLT2 Sodium-Dependent Glucose Cotransporter 2 (SGLT2) Solute carrier family 5 member 2
Type:
Protein
Mol. Mass.:
72902.00
Organism:
Homo sapiens (Human)
Description:
P31639
Residue:
672
  
Inhibitor
Name:
BDBM50436108
Synonyms:
CHEMBL2397441
Type:
Small organic molecule
Emp. Form.:
C23H24O5
Mol. Mass.:
380.4337
SMILES:
OC[C@H]1O[C@H]([C@H](O)[C@@H](O)[C@@H]1O)c1cccc(Cc2ccc3cccc3cc2)c1
: