Target
Sodium/glucose cotransporter 2
Ligand
BDBM50436118
Substrate
Meas. Tech.
ChEMBL_968063 (CHEMBL2401415)
IC50
12000±n/a nM
Citation
 Ikegai, KImamura, MSuzuki, TNakanishi, KMurakami, TKurosaki, ENoda, AKobayashi, YYokota, MKoide, TKosakai, KOhkura, YTakeuchi, MTomiyama, HOhta, M Synthesis and biological evaluation of C-glucosides with azulene rings as selective SGLT2 inhibitors for the treatment of type 2 diabetes mellitus: discovery of YM543. Bioorg Med Chem 21:3934-48 (2013)  
Target
Name:
Sodium/glucose cotransporter 2
Synonyms:
Na(+)/glucose cotransporter 2 SGLT2 Sodium-Dependent Glucose Cotransporter 2 (SGLT2) Solute carrier family 5 member 2
Type:
Protein
Mol. Mass.:
72902.00
Organism:
Homo sapiens (Human)
Description:
P31639
Residue:
672
  
Inhibitor
Name:
BDBM50436118
Synonyms:
CHEMBL2397446
Type:
Small organic molecule
Emp. Form.:
C25H26O6
Mol. Mass.:
422.4703
SMILES:
CC(=O)c1c(Cc2cccc(c2)[C@@H]2O[C@H](CO)[C@@H](O)[C@H](O)[C@H]2O)cc2cccccc12
: