Target
11-beta-hydroxysteroid dehydrogenase 1
Ligand
BDBM50436983
Substrate
Meas. Tech.
ChEMBL_971357 (CHEMBL2405920)
IC50
>1000±n/a nM
Citation
 Deng, XShen, YYang, JHe, JZhao, YPeng, LYLeng, YZhao, QS Discovery and structure-activity relationships of ent-Kaurene diterpenoids as potent and selective 11ß-HSD1 inhibitors: potential impact in diabetes. Eur J Med Chem 65:403-14 (2013)  
Target
Name:
11-beta-hydroxysteroid dehydrogenase 1
Synonyms:
11-DH 11-beta-Hydroxysteroid Dehydrogenase 1 (11-beta-HSD1) 11beta-HSD1A Corticosteroid 11-beta-dehydrogenase isozyme 1 (11-beta-HSD-1) Hsd11 | Hsd11b1
Type:
Enzyme
Mol. Mass.:
32369.70
Organism:
Mus musculus (mouse)
Description:
P50172
Residue:
292
  
Inhibitor
Name:
BDBM50436983
Synonyms:
CHEMBL2402461
Type:
Small organic molecule
Emp. Form.:
C30H38N2O3
Mol. Mass.:
474.6343
SMILES:
C[C@]1(CCC[C@]2(C)[C@@H]1CC[C@@]13C[C@H](C[C@H](O)[C@@H]21)C(=C)[C@H]3O)NC(=O)Nc1cccc2ccccc12
: