Target
11-beta-hydroxysteroid dehydrogenase type 2
Ligand
BDBM50436983
Substrate
Meas. Tech.
ChEMBL_971354 (CHEMBL2405917)
IC50
1600±n/a nM
Citation
 Deng, XShen, YYang, JHe, JZhao, YPeng, LYLeng, YZhao, QS Discovery and structure-activity relationships of ent-Kaurene diterpenoids as potent and selective 11ß-HSD1 inhibitors: potential impact in diabetes. Eur J Med Chem 65:403-14 (2013)  
Target
Name:
11-beta-hydroxysteroid dehydrogenase type 2
Synonyms:
11-DH2 11-beta-Hydroxysteroid Dehydrogenase 2 (11-beta-HSD2) 11-beta-hydroxysteroid dehydrogenase 2 11-beta-hydroxysteroid dehydrogenase type 2 (11-beta-HSD2) DHI2_HUMAN HSD11K SDR9C3
Type:
Enzyme
Mol. Mass.:
44141.72
Organism:
Homo sapiens (Human)
Description:
Purified recombinant human 11beta-HSD2.
Residue:
405
  
Inhibitor
Name:
BDBM50436983
Synonyms:
CHEMBL2402461
Type:
Small organic molecule
Emp. Form.:
C30H38N2O3
Mol. Mass.:
474.6343
SMILES:
C[C@]1(CCC[C@]2(C)[C@@H]1CC[C@@]13C[C@H](C[C@H](O)[C@@H]21)C(=C)[C@H]3O)NC(=O)Nc1cccc2ccccc12
: