Target
Acetylpolyamine amidohydrolase
Ligand
BDBM50438387
Substrate
Meas. Tech.
ChEMBL_975718 (CHEMBL2415216)
IC50
1900000±n/a nM
Citation
 Decroos, CBowman, CMChristianson, DW Synthesis and evaluation of N8-acetylspermidine analogues as inhibitors of bacterial acetylpolyamine amidohydrolase. Bioorg Med Chem 21:4530-40 (2013)  
Target
Name:
Acetylpolyamine amidohydrolase
Synonyms:
APAH_MYCRA Acetylpolyamine aminohydrolase aphA
Type:
Protein
Mol. Mass.:
36324.64
Organism:
Mycoplana ramosa (Gram-negative bacterium)
Description:
Residue:
341
  
Inhibitor
Name:
BDBM50438387
Synonyms:
CHEMBL2414003
Type:
Small organic molecule
Emp. Form.:
C10H22N2OS
Mol. Mass.:
218.359
SMILES:
CC(=O)SCCCCCNCCCN
: