Target
Cytochrome P450 2C9
Ligand
BDBM50438759
Substrate
Meas. Tech.
ChEMBL_976814 (CHEMBL2417294)
IC50
8510±n/a nM
Citation
 Oehlrich, DRombouts, FJBerthelot, DBischoff, FPDe Cleyn, MAJaroskova, LMacdonald, GMercken, MSurkyn, MTrabanco, AATresadern, GVan Brandt, SVelter, AIWu, TGijsen, HJ Design and synthesis of bicyclic heterocycles as potent¿-secretase modulators. Bioorg Med Chem Lett 23:4794-800 (2013)  
Target
Name:
Cytochrome P450 2C9
Synonyms:
(R)-limonene 6-monooxygenase CP2C9_HUMAN CYP2C9 Cytochrome P450 2C9 (CYP2C9 ) P-450MP P450 PB-1 | S-mephenytoin 4-hydroxylase
Type:
Enzyme
Mol. Mass.:
55636.33
Organism:
Homo sapiens (Human)
Description:
P11712
Residue:
490
  
Inhibitor
Name:
BDBM50438759
Synonyms:
CHEMBL2415099
Type:
Small organic molecule
Emp. Form.:
C23H21F3N6O
Mol. Mass.:
454.4476
SMILES:
COc1nc(ccc1-n1cnc(C)c1)-c1nc2[C@@H](CCCn2n1)c1ccccc1C(F)(F)F
: