Target
Orexin receptor type 2
Ligand
BDBM50423650
Substrate
Meas. Tech.
ChEMBL_977032 (CHEMBL2416556)
Ki
503±n/a nM
Citation
 Lebold, TPBonaventure, PShireman, BT Selective orexin receptor antagonists. Bioorg Med Chem Lett 23:4761-9 (2013)  
Target
Name:
Orexin receptor type 2
Synonyms:
HCRTR2 OX2R_HUMAN Orexin receptor type 2 (OR-2) Orexin receptor type 2 (OX2R) Ox-2-R | Ox2-R
Type:
Protein
Mol. Mass.:
50710.53
Organism:
Homo sapiens (Human)
Description:
O43614
Residue:
444
  
Inhibitor
Name:
BDBM50423650
Synonyms:
CHEMBL522758 | SB-410220
Type:
Small organic molecule
Emp. Form.:
C18H16F2N4O
Mol. Mass.:
342.3426
SMILES:
CN(C)c1ccc(NC(=O)Nc2ccnc3c(F)ccc(F)c23)cc1
: