Target
Cholinesterase
Ligand
BDBM50438839
Substrate
Meas. Tech.
ChEMBL_977209 (CHEMBL2416839)
IC50
5060±n/a nM
Citation
 Alpan, ASParlar, SCarlino, LTarikogullari, AHAlptüzün, VGünes, HS Synthesis, biological activity and molecular modeling studies on 1H-benzimidazole derivatives as acetylcholinesterase inhibitors. Bioorg Med Chem 21:4928-37 (2013)  
Target
Name:
Cholinesterase
Synonyms:
BCHE CHLE_HORSE | Cholinesterase
Type:
Enzyme
Mol. Mass.:
65643.35
Organism:
Equus caballus (Horse)
Description:
P81908
Residue:
574
  
Inhibitor
Name:
BDBM50438839
Synonyms:
CHEMBL2413745
Type:
Small organic molecule
Emp. Form.:
C19H23N3O
Mol. Mass.:
309.4054
SMILES:
CCN(CC)CCOc1ccc(cc1)-c1nc2ccccc2[nH]1
: