Target
Acetylcholinesterase
Ligand
BDBM50438844
Substrate
Meas. Tech.
ChEMBL_977211 (CHEMBL2416841)
IC50
3240±n/a nM
Citation
 Alpan, ASParlar, SCarlino, LTarikogullari, AHAlptüzün, VGünes, HS Synthesis, biological activity and molecular modeling studies on 1H-benzimidazole derivatives as acetylcholinesterase inhibitors. Bioorg Med Chem 21:4928-37 (2013)  
Target
Name:
Acetylcholinesterase
Synonyms:
ACES_ELEEL Acetylcholinesterase (EeAChE) | ache
Type:
Enzyme
Mol. Mass.:
71812.79
Organism:
Electrophorus electricus (Electric eel)
Description:
Residue:
633
  
Inhibitor
Name:
BDBM50438844
Synonyms:
CHEMBL2413742
Type:
Small organic molecule
Emp. Form.:
C19H20ClN3O
Mol. Mass.:
341.835
SMILES:
Clc1ccc2nc([nH]c2c1)-c1ccc(OCCN2CCCC2)cc1
: