Target
Acetylcholinesterase
Ligand
BDBM50438832
Substrate
Meas. Tech.
ChEMBL_977211 (CHEMBL2416841)
IC50
2340±n/a nM
Citation
 Alpan, ASParlar, SCarlino, LTarikogullari, AHAlptüzün, VGünes, HS Synthesis, biological activity and molecular modeling studies on 1H-benzimidazole derivatives as acetylcholinesterase inhibitors. Bioorg Med Chem 21:4928-37 (2013)  
Target
Name:
Acetylcholinesterase
Synonyms:
ACES_ELEEL Acetylcholinesterase (EeAChE) | ache
Type:
Enzyme
Mol. Mass.:
71812.79
Organism:
Electrophorus electricus (Electric eel)
Description:
Residue:
633
  
Inhibitor
Name:
BDBM50438832
Synonyms:
CHEMBL2413734
Type:
Small organic molecule
Emp. Form.:
C20H25N3O
Mol. Mass.:
323.432
SMILES:
CCN(CC)CCOc1ccc(cc1)-c1nc2ccc(C)cc2[nH]1
: