Target
Cholinesterase
Ligand
BDBM50438844
Substrate
Meas. Tech.
ChEMBL_977209 (CHEMBL2416839)
IC50
3420±n/a nM
Citation
 Alpan, ASParlar, SCarlino, LTarikogullari, AHAlptüzün, VGünes, HS Synthesis, biological activity and molecular modeling studies on 1H-benzimidazole derivatives as acetylcholinesterase inhibitors. Bioorg Med Chem 21:4928-37 (2013)  
Target
Name:
Cholinesterase
Synonyms:
BCHE CHLE_HORSE | Cholinesterase
Type:
Enzyme
Mol. Mass.:
65643.35
Organism:
Equus caballus (Horse)
Description:
P81908
Residue:
574
  
Inhibitor
Name:
BDBM50438844
Synonyms:
CHEMBL2413742
Type:
Small organic molecule
Emp. Form.:
C19H20ClN3O
Mol. Mass.:
341.835
SMILES:
Clc1ccc2nc([nH]c2c1)-c1ccc(OCCN2CCCC2)cc1
: