Target
Renin
Ligand
BDBM50439254
Substrate
Meas. Tech.
ChEMBL_979177 (CHEMBL2421977)
IC50
6.9±n/a nM
Citation
 Mori, YOgawa, YMochizuki, ANakamura, YFujimoto, TSugita, CMiyazaki, STamaki, KNagayama, TNagai, YInoue, SChiba, KNishi, T Synthesis and optimization of novel (3S,5R)-5-(2,2-dimethyl-5-oxo-4-phenylpiperazin-1-yl)piperidine-3-carboxamides as orally active renin inhibitors. Bioorg Med Chem 21:5907-22 (2013)  
Target
Name:
Renin
Synonyms:
Angiotensinogenase RENI_MACFA
Type:
PROTEIN
Mol. Mass.:
45012.96
Organism:
Macaca fascicularis
Description:
ChEMBL_979177
Residue:
406
  
Inhibitor
Name:
BDBM50439254
Synonyms:
CHEMBL2419041
Type:
Small organic molecule
Emp. Form.:
C28H37ClFN5O2
Mol. Mass.:
530.077
SMILES:
CC(C)C[C@@H](NC(=O)[C@@H]1CNC[C@@H](C1)N1CC(=O)N(CC1(C)C)c1ccccc1Cl)c1cncc(F)c1
: