Target
Androgen receptor
Ligand
BDBM50440233
Substrate
Meas. Tech.
ChEMBL_982001 (CHEMBL2428205)
Ki
2513±n/a nM
Citation
 Sheppeck, JEGilmore, JLXiao, HYDhar, TGNirschl, DDoweyko, AMSack, JSCorbett, MJMalley, MFGougoutas, JZMckay, LCunningham, MDHabte, SFDodd, JHNadler, SGSomerville, JEBarrish, JC Discovery of potent and selective nonsteroidal indazolyl amide glucocorticoid receptor agonists. Bioorg Med Chem Lett 23:5442-7 (2013)  
Target
Name:
Androgen receptor
Synonyms:
ANDR_HUMAN Androgen Receptor Androgen receptor/Baculoviral IAP repeat-containing protein 2 Dihydrotestosterone receptor Nuclear receptor subfamily 3 group C member 4
Type:
Receptor
Mol. Mass.:
99185.27
Organism:
Homo sapiens (Human)
Description:
CHO cells were stably transfected with human AR gene.
Residue:
920
  
Inhibitor
Name:
BDBM50440233
Synonyms:
CHEMBL2426636
Type:
Small organic molecule
Emp. Form.:
C23H24FN5OS
Mol. Mass.:
437.533
SMILES:
CCCC(c1ccc2n(ncc2c1)-c1ccc(F)cc1)C(C)(C)C(=O)Nc1nncs1
: