Target
Glucocorticoid receptor
Ligand
BDBM50440233
Substrate
Meas. Tech.
ChEMBL_982008 (CHEMBL2428212)
Ki
1.7±n/a nM
Citation
 Sheppeck, JEGilmore, JLXiao, HYDhar, TGNirschl, DDoweyko, AMSack, JSCorbett, MJMalley, MFGougoutas, JZMckay, LCunningham, MDHabte, SFDodd, JHNadler, SGSomerville, JEBarrish, JC Discovery of potent and selective nonsteroidal indazolyl amide glucocorticoid receptor agonists. Bioorg Med Chem Lett 23:5442-7 (2013)  
Target
Name:
Glucocorticoid receptor
Synonyms:
GCR_HUMAN GRL Glucocorticoid receptor (GRFP) Nuclear receptor subfamily 3 group C member 1
Type:
Enzyme
Mol. Mass.:
85656.87
Organism:
Homo sapiens (Human)
Description:
P04150
Residue:
777
  
Inhibitor
Name:
BDBM50440233
Synonyms:
CHEMBL2426636
Type:
Small organic molecule
Emp. Form.:
C23H24FN5OS
Mol. Mass.:
437.533
SMILES:
CCCC(c1ccc2n(ncc2c1)-c1ccc(F)cc1)C(C)(C)C(=O)Nc1nncs1
: