Target
Metabotropic glutamate receptor 5
Ligand
BDBM50440814
Substrate
Meas. Tech.
ChEMBL_983856 (CHEMBL2433294)
EC50
61±n/a nM
Citation
 Rosse, G Trisubstituted imidazoles as positive modulators of metabotropic glutamate receptor subtype 5. ACS Med Chem Lett 4:819-21 (2013)  
Target
Name:
Metabotropic glutamate receptor 5
Synonyms:
GPRC1E GRM5_HUMAN metabotropic glutamate 5 | metabotropic glutamate 5a
Type:
Enzyme
Mol. Mass.:
132484.72
Organism:
Homo sapiens (Human)
Description:
Residue:
1212
  
Inhibitor
Name:
BDBM50440814
Synonyms:
CHEMBL2431427
Type:
Small organic molecule
Emp. Form.:
C25H23FN4O2
Mol. Mass.:
430.4741
SMILES:
Cc1nc2CN(CCc2o1)C(=O)Cn1cc(nc1-c1ccccc1)-c1ccc(F)c(C)c1
: