Target
1-deoxy-D-xylulose 5-phosphate reductoisomerase
Ligand
BDBM50441210
Substrate
Meas. Tech.
ChEMBL_983995 (CHEMBL2434044)
IC50
9.2±n/a nM
Citation
 Kunfermann, ALienau, CIllarionov, BHeld, JGräwert, TBehrendt, CTWerner, PHähn, SEisenreich, WRiederer, UMordmüller, BBacher, AFischer, MGroll, MKurz, T IspC as target for antiinfective drug discovery: synthesis, enantiomeric separation, and structural biology of fosmidomycin thia isosters. J Med Chem 56:8151-62 (2013)  
Target
Name:
1-deoxy-D-xylulose 5-phosphate reductoisomerase
Synonyms:
DXR_MYCTU | dxr
Type:
PROTEIN
Mol. Mass.:
42846.92
Organism:
Mycobacterium tuberculosis
Description:
ChEMBL_1474510
Residue:
413
  
Inhibitor
Name:
BDBM50441210
Synonyms:
CHEMBL2431008
Type:
Small organic molecule
Emp. Form.:
C10H12Cl2NO5PS
Mol. Mass.:
360.151
SMILES:
CN(O)C(=O)CSC(c1ccc(Cl)c(Cl)c1)P(O)(O)=O
: