Target
Glutamate carboxypeptidase 2
Ligand
BDBM50441243
Substrate
Meas. Tech.
ChEMBL_984058 (CHEMBL2434268)
Kd
143±n/a nM
Citation
 Harada, NKimura, HOno, MSaji, H Preparation of asymmetric urea derivatives that target prostate-specific membrane antigen for SPECT imaging. J Med Chem 56:7890-901 (2013)  
Target
Name:
Glutamate carboxypeptidase 2
Synonyms:
FGCP FOLH1 Folate hydrolase 1 Glutamate carboxypeptidase 2 Membrane glutamate carboxypeptidase NAALAD1 PSM Prostate-specific membrane antigen mGCP
Type:
PROTEIN
Mol. Mass.:
84333.66
Organism:
Homo sapiens (Human)
Description:
ChEMBL_1497035
Residue:
750
  
Inhibitor
Name:
BDBM50441243
Synonyms:
CHEMBL2431334
Type:
Small organic molecule
Emp. Form.:
C15H17IN2O8
Mol. Mass.:
480.2086
SMILES:
OC(=O)CC[C@H](NC(=O)N[C@@H](Cc1ccc(O)c(I)c1)C(O)=O)C(O)=O
: