Target
Lysine-specific histone demethylase 1A
Ligand
BDBM50442002
Substrate
Meas. Tech.
ChEMBL_992728 (CHEMBL2443630)
IC50
>125000±n/a nM
Citation
 Zheng, YCDuan, YCMa, JLXu, RMZi, XLv, WLWang, MMYe, XWZhu, SMobley, DZhu, YYWang, JWLi, JFWang, ZRZhao, WLiu, HM Triazole-dithiocarbamate based selective lysine specific demethylase 1 (LSD1) inactivators inhibit gastric cancer cell growth, invasion, and migration. J Med Chem 56:8543-60 (2013)  
Target
Name:
Lysine-specific histone demethylase 1A
Synonyms:
AOF2 Flavin-containing amine oxidase domain-containing protein 2 KDM1A KIAA0601 Lysine-specific demethylase 1 (LSD1) Lysine-specific histone demethylase 1 (LSD1)
Type:
Enzyme
Mol. Mass.:
92901.01
Organism:
Homo sapiens (Human)
Description:
O60341
Residue:
852
  
Inhibitor
Name:
BDBM50442002
Synonyms:
CHEMBL2440549
Type:
Small organic molecule
Emp. Form.:
C18H25N5O4S2
Mol. Mass.:
439.552
SMILES:
CC(C)(C)OC(=O)N1CCN(CC1)C(=S)SCc1cn(CC2=CC(=O)OC2)nn1
: