Target
Bacterial leucyl aminopeptidase
Ligand
BDBM50442433
Substrate
Meas. Tech.
ChEMBL_989563 (CHEMBL2444619)
Ki
78000±n/a nM
Citation
 Al-Lakkis-Wehbe, MChaillou, BDefoin, AAlbrecht, STarnus, C Synthesis of amino-hydroxy-benzocycloheptenones as potent, selective, non-peptidic dinuclear zinc metalloaminopeptidase inhibitors. Bioorg Med Chem 21:6447-55 (2013)  
Target
Name:
Bacterial leucyl aminopeptidase
Synonyms:
AMPX_VIBPR | Bacterial leucyl aminopeptidase precursor
Type:
PROTEIN
Mol. Mass.:
54213.72
Organism:
Vibrio proteolyticus
Description:
ChEMBL_1507540
Residue:
504
  
Inhibitor
Name:
BDBM50442433
Synonyms:
CHEMBL2443107
Type:
Small organic molecule
Emp. Form.:
C11H15NO2
Mol. Mass.:
193.2423
SMILES:
N[C@H]1[C@@H](O)Cc2ccccc2C[C@H]1O
: