Target
Aminopeptidase N
Ligand
BDBM50442433
Substrate
Meas. Tech.
ChEMBL_989564 (CHEMBL2444620)
IC50
>1000000±n/a nM
Citation
 Al-Lakkis-Wehbe, MChaillou, BDefoin, AAlbrecht, STarnus, C Synthesis of amino-hydroxy-benzocycloheptenones as potent, selective, non-peptidic dinuclear zinc metalloaminopeptidase inhibitors. Bioorg Med Chem 21:6447-55 (2013)  
Target
Name:
Aminopeptidase N
Synonyms:
AMPN_PIG AP-M Alanyl aminopeptidase Aminopeptidase N (APN) Microsomal aminopeptidase pAPN
Type:
Protein
Mol. Mass.:
108810.25
Organism:
Sus scrofa (Pig)
Description:
P15145
Residue:
963
  
Inhibitor
Name:
BDBM50442433
Synonyms:
CHEMBL2443107
Type:
Small organic molecule
Emp. Form.:
C11H15NO2
Mol. Mass.:
193.2423
SMILES:
N[C@H]1[C@@H](O)Cc2ccccc2C[C@H]1O
: