Target
Aminopeptidase N
Ligand
BDBM50336495
Substrate
Meas. Tech.
ChEMBL_989564 (CHEMBL2444620)
Ki
1000±n/a nM
Citation
 Al-Lakkis-Wehbe, MChaillou, BDefoin, AAlbrecht, STarnus, C Synthesis of amino-hydroxy-benzocycloheptenones as potent, selective, non-peptidic dinuclear zinc metalloaminopeptidase inhibitors. Bioorg Med Chem 21:6447-55 (2013)  
Target
Name:
Aminopeptidase N
Synonyms:
AMPN_PIG AP-M Alanyl aminopeptidase Aminopeptidase N (APN) Microsomal aminopeptidase pAPN
Type:
Protein
Mol. Mass.:
108810.25
Organism:
Sus scrofa (Pig)
Description:
P15145
Residue:
963
  
Inhibitor
Name:
BDBM50336495
Synonyms:
7-Amino-5,7,8,9-tetrahydro-benzocyclohepten-6-one, hydrochloride | CHEMBL1668626
Type:
Small organic molecule
Emp. Form.:
C11H13NO
Mol. Mass.:
175.227
SMILES:
NC1CCc2ccccc2CC1=O
: