Target
D(2) dopamine receptor
Ligand
BDBM50442749
Substrate
Meas. Tech.
ChEMBL_989368 (CHEMBL2443403)
Ki
770±n/a nM
Citation
 Banerjee, AMaschauer, SHübner, HGmeiner, PPrante, O Click chemistry based synthesis of dopamine D4 selective receptor ligands for the selection of potential PET tracers. Bioorg Med Chem Lett 23:6079-82 (2013)  
Target
Name:
D(2) dopamine receptor
Synonyms:
D(2) dopamine receptor DOPAMINE D2 Long DRD2 Dopamine D2 receptor Dopamine D2 receptor (D2R) Dopamine2-like | d2
Type:
Cell-surface receptors
Mol. Mass.:
50647.10
Organism:
Homo sapiens (Human)
Description:
P14416
Residue:
443
  
Inhibitor
Name:
BDBM50442749
Synonyms:
CHEMBL2443007
Type:
Small organic molecule
Emp. Form.:
C25H32FN5O3
Mol. Mass.:
469.5517
SMILES:
COc1ccccc1N1CCN(Cc2cn(nn2)-c2ccc(OCCCOCCF)cc2)CC1
: