Target
D(3) dopamine receptor
Ligand
BDBM50442749
Substrate
Meas. Tech.
ChEMBL_989366 (CHEMBL2443401)
Ki
2900±n/a nM
Citation
 Banerjee, AMaschauer, SHübner, HGmeiner, PPrante, O Click chemistry based synthesis of dopamine D4 selective receptor ligands for the selection of potential PET tracers. Bioorg Med Chem Lett 23:6079-82 (2013)  
Target
Name:
D(3) dopamine receptor
Synonyms:
DOPAMINE D3 DRD3_HUMAN Dopamine D3 receptor (D3) Dopamine receptor Dopamine receptor D3
Type:
Mol. Mass.:
44243.43
Organism:
Homo sapiens (Human)
Description:
Residue:
400
  
Inhibitor
Name:
BDBM50442749
Synonyms:
CHEMBL2443007
Type:
Small organic molecule
Emp. Form.:
C25H32FN5O3
Mol. Mass.:
469.5517
SMILES:
COc1ccccc1N1CCN(Cc2cn(nn2)-c2ccc(OCCCOCCF)cc2)CC1
: