Target
Solute carrier organic anion transporter family member 1B3
Ligand
BDBM50442889
Substrate
Meas. Tech.
ChEMBL_1265866 (CHEMBL3039492)
IC50
776±n/a nM
Citation
 De Bruyn, Tvan Westen, GJIjzerman, APStieger, Bde Witte, PAugustijns, PFAnnaert, PP Structure-based identification of OATP1B1/3 inhibitors. Mol Pharmacol 83:1257-67 (2013)  
Target
Name:
Solute carrier organic anion transporter family member 1B3
Synonyms:
LST2 OATP8 SLC21A8 SO1B3_HUMAN Solute carrier organic anion transporter family member 1B3 (OATP1B3)
Type:
Protein
Mol. Mass.:
77425.75
Organism:
Homo sapiens (Human)
Description:
Q9NPD5
Residue:
702
  
Inhibitor
Name:
BDBM50442889
Synonyms:
CHEMBL3039300
Type:
Small organic molecule
Emp. Form.:
C41H52O17
Mol. Mass.:
816.8414
SMILES:
CCC(C)C(=O)O[C@@H]1C[C@@]2(C)[C@@H](OC(=O)CC22OC3(C)O[C@]11[C@]4(C)[C@@H](CC(=O)OC)C5(C)CC4(O)[C@](O)(C5OC(=O)C4(C)OC4C)[C@@H](OC(C)=O)[C@]21O3)c1ccoc1
: