Target
Solute carrier organic anion transporter family member 1B3
Ligand
BDBM50442876
Substrate
Meas. Tech.
ChEMBL_1265866 (CHEMBL3039492)
IC50
3311±n/a nM
Citation
 De Bruyn, Tvan Westen, GJIjzerman, APStieger, Bde Witte, PAugustijns, PFAnnaert, PP Structure-based identification of OATP1B1/3 inhibitors. Mol Pharmacol 83:1257-67 (2013)  
Target
Name:
Solute carrier organic anion transporter family member 1B3
Synonyms:
LST2 OATP8 SLC21A8 SO1B3_HUMAN Solute carrier organic anion transporter family member 1B3 (OATP1B3)
Type:
Protein
Mol. Mass.:
77425.75
Organism:
Homo sapiens (Human)
Description:
Q9NPD5
Residue:
702
  
Inhibitor
Name:
BDBM50442876
Synonyms:
CHEMBL3138664
Type:
Small organic molecule
Emp. Form.:
C26H34O5
Mol. Mass.:
426.5452
SMILES:
[H][C@@]12CC[C@]3(C)[C@H](OC(=O)C=C3[C@@]1(C)[C@H](O)C[C@]1([H])C(C)(C)C(=O)CC[C@@]21C)c1ccoc1
: