Target
Solute carrier organic anion transporter family member 1B1
Ligand
BDBM50442889
Substrate
Meas. Tech.
ChEMBL_1265863 (CHEMBL3039489)
IC50
676±n/a nM
Citation
 De Bruyn, Tvan Westen, GJIjzerman, APStieger, Bde Witte, PAugustijns, PFAnnaert, PP Structure-based identification of OATP1B1/3 inhibitors. Mol Pharmacol 83:1257-67 (2013)  
Target
Name:
Solute carrier organic anion transporter family member 1B1
Synonyms:
LST1 OATP2 SLC21A6 SO1B1_HUMAN Solute carrier organic anion transporter family member 1B1 (OATP1B1) | Thromboxane B2
Type:
Protein
Mol. Mass.:
76468.06
Organism:
Homo sapiens (Human)
Description:
Q9Y6L6
Residue:
691
  
Inhibitor
Name:
BDBM50442889
Synonyms:
CHEMBL3039300
Type:
Small organic molecule
Emp. Form.:
C41H52O17
Mol. Mass.:
816.8414
SMILES:
CCC(C)C(=O)O[C@@H]1C[C@@]2(C)[C@@H](OC(=O)CC22OC3(C)O[C@]11[C@]4(C)[C@@H](CC(=O)OC)C5(C)CC4(O)[C@](O)(C5OC(=O)C4(C)OC4C)[C@@H](OC(C)=O)[C@]21O3)c1ccoc1
: