Target
Tyrosine-protein kinase ITK/TSK
Ligand
BDBM50443181
Substrate
Meas. Tech.
ChEMBL_1276382 (CHEMBL3088400)
Ki
0.600000±n/a nM
Citation
 MacKinnon, CHLau, KBurch, JDChen, YDines, JDing, XEigenbrot, CHeifetz, AJaochico, AJohnson, AKraemer, JKruger, SKrülle, TMLiimatta, MLy, JMaghames, RMontalbetti, CAOrtwine, DFPérez-Fuertes, YShia, SStein, DBTrani, GVaidya, DGWang, XBromidge, SMWu, LCPei, Z Structure-based design and synthesis of potent benzothiazole inhibitors of interleukin-2 inducible T cell kinase (ITK). Bioorg Med Chem Lett 23:6331-5 (2013)  
Target
Name:
Tyrosine-protein kinase ITK/TSK
Synonyms:
EMT ITK_HUMAN LYK Tyrosine-protein kinase ITK Tyrosine-protein kinase Lyk
Type:
Protein
Mol. Mass.:
71839.20
Organism:
Homo sapiens (Human)
Description:
Q08881
Residue:
620
  
Inhibitor
Name:
BDBM50443181
Synonyms:
CHEMBL3086535
Type:
Small organic molecule
Emp. Form.:
C23H23N5OS
Mol. Mass.:
417.527
SMILES:
CN(C)Cc1ccc(cc1)C1CC1C(=O)Nc1nc2ccc(cc2s1)-c1cn[nH]c1
: