Target
Nicotinamide phosphoribosyltransferase
Ligand
BDBM50443792
Substrate
Meas. Tech.
ChEMBL_1280599 (CHEMBL3096860)
IC50
133±n/a nM
Citation
 Christensen, MKErichsen, KDOlesen, UHTjørnelund, JFristrup, PThougaard, ANielsen, SJSehested, MJensen, PBLoza, EKalvinsh, IGarten, AKiess, WBjörkling, F Nicotinamide phosphoribosyltransferase inhibitors, design, preparation, and structure-activity relationship. J Med Chem 56:9071-88 (2013)  
Target
Name:
Nicotinamide phosphoribosyltransferase
Synonyms:
NAMPT NAmPRTase Nicotinamide phosphoribosyltransferase (NAMPT) PBEF1 | Pre-B-cell colony-enhancing factor 1
Type:
Enzyme
Mol. Mass.:
55524.98
Organism:
Homo sapiens (Human)
Description:
P43490
Residue:
491
  
Inhibitor
Name:
BDBM50443792
Synonyms:
CHEMBL3094237
Type:
Small organic molecule
Emp. Form.:
C25H43N5O4S
Mol. Mass.:
509.705
SMILES:
O=C(NCCCCCCS(=O)(=O)N(CCN1CCOCC1)CC1CCCCC1)Nc1ccncc1
: