Target
Nicotinamide phosphoribosyltransferase
Ligand
BDBM50443797
Substrate
Meas. Tech.
ChEMBL_1280599 (CHEMBL3096860)
IC50
23±n/a nM
Citation
 Christensen, MKErichsen, KDOlesen, UHTjørnelund, JFristrup, PThougaard, ANielsen, SJSehested, MJensen, PBLoza, EKalvinsh, IGarten, AKiess, WBjörkling, F Nicotinamide phosphoribosyltransferase inhibitors, design, preparation, and structure-activity relationship. J Med Chem 56:9071-88 (2013)  
Target
Name:
Nicotinamide phosphoribosyltransferase
Synonyms:
NAMPT NAmPRTase Nicotinamide phosphoribosyltransferase (NAMPT) PBEF1 | Pre-B-cell colony-enhancing factor 1
Type:
Enzyme
Mol. Mass.:
55524.98
Organism:
Homo sapiens (Human)
Description:
P43490
Residue:
491
  
Inhibitor
Name:
BDBM50443797
Synonyms:
CHEMBL3094224
Type:
Small organic molecule
Emp. Form.:
C28H40N6O5S
Mol. Mass.:
572.719
SMILES:
O=C1C(NCCCCCCS(=O)(=O)N(CCCN2CCOCC2)Cc2cccnc2)C(Nc2ccncc2)C1=O
: