Target
Nicotinamide phosphoribosyltransferase
Ligand
BDBM50443800
Substrate
Meas. Tech.
ChEMBL_1280599 (CHEMBL3096860)
IC50
0.300000±n/a nM
Citation
 Christensen, MKErichsen, KDOlesen, UHTjørnelund, JFristrup, PThougaard, ANielsen, SJSehested, MJensen, PBLoza, EKalvinsh, IGarten, AKiess, WBjörkling, F Nicotinamide phosphoribosyltransferase inhibitors, design, preparation, and structure-activity relationship. J Med Chem 56:9071-88 (2013)  
Target
Name:
Nicotinamide phosphoribosyltransferase
Synonyms:
NAMPT NAmPRTase Nicotinamide phosphoribosyltransferase (NAMPT) PBEF1 | Pre-B-cell colony-enhancing factor 1
Type:
Enzyme
Mol. Mass.:
55524.98
Organism:
Homo sapiens (Human)
Description:
P43490
Residue:
491
  
Inhibitor
Name:
BDBM50443800
Synonyms:
CHEMBL3094255
Type:
Small organic molecule
Emp. Form.:
C25H41N7O4S
Mol. Mass.:
535.703
SMILES:
O=S(=O)(CCCCCCNC(NC#N)=Nc1ccncc1)N(OCCN1CCOCC1)C1CCCCC1
: